{"text_format":"3","workbook":"xlsx","n_sheets":3,"sheets":["Sheet1","table","about"],"not_rendered":{"images":25,"macros":1},"read":"whole","date_system":"1900"}

{"sheet":"Sheet1","index":0,"n_rows":28,"n_cols":16,"rows_kept":28}
["Hole Sizing Guide",{"$nulls":3},{"$f":"IF(AND(table!B2=1,table!B5=1,table!B6=2)=TRUE,\"ⓘ Sheet metal cannot have threaded hole\",\"\")","v":""},{"$nulls":9},"ⓘ","Pink cells indicate missing selection."]
["Demo version: No proprietary data; output values are random placeholders."]
[{"$nulls":4},{"$f":"IF(table!F2<>\"\",table!F2,\".xxx\")","v":".xxx"},null,"⌵","⌀",{"$f":"_xlfn.IFS(table!B7=1,\"N/A\",AND(table!F7<>\"\",table!B7<>1)=TRUE,table!F7,AND(table!F7=\"\",table!B7<>1)=TRUE,\".xxx\")","v":".xxx"},"×",{"$f":"IF(table!F8<>\"\",table!F8&\"°\",\".xxx\")","v":".xxx"},{"$nulls":4},"Please ensure macros are enabled."]
[{"$nulls":4},{"$f":"IF(table!F3<>\"\",table!F3,\".xxx\")","v":".xxx"},{"$nulls":3},{"$f":"IF(ISBLANK(table!F6)=FALSE,table!F6,\".xxx\")","v":""}]
[]
[{"$nulls":4},"⌖","⌀",{"$f":"IF(table!F5<>\"\",table!F5,\".xxx\")","v":".xxx"},"Ⓜ","X","X","X"]
[]
[]
["Fastener Size"]
[null,"Screws"]
[]
[]
[null,"Rivets"]
[]
[]
[]
[]
[{"$nulls":8},"Countersink"]
["Fit"]
[]
{"$rows_left_out":9}
{"sheet":"table","index":1,"n_rows":68,"n_cols":70,"rows_kept":68}
["VAR","VALUE","DESC",null,"OUT","VALUE","DESC",null,"Table 1","Random Placeholder Values for Engineering Standard",{"$nulls":8},"Table 4","Check nominalScrew value",{"$nulls":5},"Table 5","Check fit type",{"$nulls":5},"Table 6","Check Material Type",{"$nulls":5},"Table 7","Check Hole Type",{"$nulls":5},"Table 8","Check Csk",{"$nulls":5},"Table 9","Results",{"$nulls":5},"Table 10","Resulting Values"]
["fastenerType",1,"0 = N/A 1 = SCREW, 2 = BLD RIVET, 3 = SOLID RIVET",null,"holeLimMax",{"$f":"CONCATENATE(BP4,BP11,BP18,BP25,BP32,BP39,BP46,Y56,Y57,Y58,Y59,Y60,AA64,AA65,AA66,AA67,AA68)","v":""},null,null,"NominalScrew var value","NOMINAL SCREWS","DESC","SHEET METAL",null,"MACHINED",null,"VAC FORMED"]
["fitType",0,"0 = N/A, 1 = TIGHT FIT, 2 = STANDARD",null,"holeLimMin",{"$f":"CONCATENATE(BP5,BP12,BP19,BP26,BP33,BP40,BP47,Z56,Z57,Z58,Z59,Z60,AB64,AB65,AB66,AB67,AB68)","v":""},{"$nulls":5},"TIGHT FIT","STANDARD","TIGHT FIT","STANDARD","TIGHT FIT","STANDARD"]
["nominalScrew",0,"Indexed list of fastener sizes, see var name in Table 1, 0 = N/A",null,"modelToDia",{"$f":"CONCATENATE(BP6,BP13,BP20,BP27,BP34,BP41,BP48)","v":""},"n/a for rivets",null,1,".112(#4)","HOLE LIMIT MAX",0.024,0.032,0.011,0.075,0.017,0.023,null,{"$f":"AND(B2=1,B4=1)","v":false},{"$f":"AND(B2=1,B4=1)","v":false},{"$f":"AND(B2=1,B4=1)","v":false},{"$f":"AND(B2=1,B4=1)","v":false},{"$f":"AND(B2=1,B4=1)","v":false},{"$f":"AND(B2=1,B4=1)","v":false},null,{"$f":"IF(B3=1,TRUE,FALSE)","v":false},{"$f":"IF(B3=2,TRUE,FALSE)","v":false},{"$f":"IF(B3=1,TRUE,FALSE)","v":false},{"$f":"IF(B3=2,TRUE,FALSE)","v":false},{"$f":"IF(B3=1,TRUE,FALSE)","v":false},{"$f":"IF(B3=2,TRUE,FALSE)","v":false},null,{"$f":"IF(B5=1,TRUE,FALSE)","v":false},{"$f":"IF(B5=1,TRUE,FALSE)","v":false},{"$f":"IF(B5=2,TRUE,FALSE)","v":false},{"$f":"IF(B5=2,TRUE,FALSE)","v":false},{"$f":"IF(B5=3,TRUE,FALSE)","v":false},{"$f":"IF(B5=3,TRUE,FALSE)","v":false},{"$nulls":15},{"$f":"AND(S4=TRUE,Z4=TRUE,AG4=TRUE)","v":false},{"$f":"AND(T4=TRUE,AA4=TRUE,AH4=TRUE)","v":false},false,false,false,false,null,{"$f":"IF(BB4=TRUE,L4)","v":false},{"$f":"IF(BC4=TRUE,M4)","v":false},false,false,false,false,null,{"$f":"IFERROR(INDEX(BI4:BN4,MATCH(TRUE,TRANSPOSE(BB4:BG4),0)),\"\")","v":""},null,{"$f":"CONCATENATE(BP7,BP4,BP7)","v":""}]
["materialType",0,"0 = N/A, 1 = SHEET METAL, 2 = MACHINED, 3 = VAC FORMED",null,"posTol",{"$f":"CONCATENATE(BP7,BP8,BP9,BP14,BP15,BP16,BP21,BP22,BP23,BP28,BP29,BP30,BP35,BP36,BP37,BP42,BP43,BP44,BP49,BP50,BP51,AA56,AA57,AA58,AA59,AA60,AC64,AC65,AC66,AC67,AC68)","v":""},{"$nulls":4},"HOLE LIMIT MIN",0.087,0.042,0.102,0.113,0.039,0.121,null,{"$f":"AND(B2=1,B4=1)","v":false},{"$f":"AND(B2=1,B4=1)","v":false},{"$f":"AND(B2=1,B4=1)","v":false},{"$f":"AND(B2=1,B4=1)","v":false},{"$f":"AND(B2=1,B4=1)","v":false},{"$f":"AND(B2=1,B4=1)","v":false},null,{"$f":"IF(B3=1,TRUE,FALSE)","v":false},{"$f":"IF(B3=2,TRUE,FALSE)","v":false},{"$f":"IF(B3=1,TRUE,FALSE)","v":false},{"$f":"IF(B3=2,TRUE,FALSE)","v":false},{"$f":"IF(B3=1,TRUE,FALSE)","v":false},{"$f":"IF(B3=2,TRUE,FALSE)","v":false},null,{"$f":"IF(B5=1,TRUE,FALSE)","v":false},{"$f":"IF(B5=1,TRUE,FALSE)","v":false},{"$f":"IF(B5=2,TRUE,FALSE)","v":false},{"$f":"IF(B5=2,TRUE,FALSE)","v":false},{"$f":"IF(B5=3,TRUE,FALSE)","v":false},{"$f":"IF(B5=3,TRUE,FALSE)","v":false},{"$nulls":15},{"$f":"AND(S5=TRUE,Z5=TRUE,AG5=TRUE)","v":false},{"$f":"AND(T5=TRUE,AA5=TRUE,AH5=TRUE)","v":false},{"$f":"AND(U5=TRUE,AB5=TRUE,AI5=TRUE)","v":false},{"$f":"AND(V5=TRUE,AC5=TRUE,AJ5=TRUE)","v":false},{"$f":"AND(W5=TRUE,AD5=TRUE,AK5=TRUE)","v":false},{"$f":"AND(X5=TRUE,AE5=TRUE,AL5=TRUE)","v":false},null,{"$f":"IF(BB5=TRUE,L5)","v":false},false,false,false,false,false,null,{"$f":"IFERROR(INDEX(BI5:BN5,MATCH(TRUE,TRANSPOSE(BB5:BG5),0)),\"\")","v":""}]
["holeType",0,"0 = N/A, 1 = FLOATING, 2 = FIXED THREADED, 3 = FIXED CLEARANCE",null,"cskDiaMin",{"$f":"CONCATENATE(AF64,AF65,AF66,AF67,AF68)","v":""},{"$nulls":4},"MODEL TO DIAMETER",0.083,0.018,0.065,0.027,0.11,0.024,null,{"$f":"AND(B2=1,B4=1)","v":false},{"$f":"AND(B2=1,B4=1)","v":false},{"$f":"AND(B2=1,B4=1)","v":false},{"$f":"AND(B2=1,B4=1)","v":false},{"$f":"AND(B2=1,B4=1)","v":false},{"$f":"AND(B2=1,B4=1)","v":false},null,{"$f":"IF(B3=1,TRUE,FALSE)","v":false},{"$f":"IF(B3=2,TRUE,FALSE)","v":false},{"$f":"IF(B3=1,TRUE,FALSE)","v":false},{"$f":"IF(B3=2,TRUE,FALSE)","v":false},{"$f":"IF(B3=1,TRUE,FALSE)","v":false},{"$f":"IF(B3=2,TRUE,FALSE)","v":false},null,{"$f":"IF(B5=1,TRUE,FALSE)","v":false},{"$f":"IF(B5=1,TRUE,FALSE)","v":false},{"$f":"IF(B5=2,TRUE,FALSE)","v":false},{"$f":"IF(B5=2,TRUE,FALSE)","v":false},{"$f":"IF(B5=3,TRUE,FALSE)","v":false},{"$f":"IF(B5=3,TRUE,FALSE)","v":false},{"$nulls":15},{"$f":"AND(S6=TRUE,Z6=TRUE,AG6=TRUE)","v":false},false,false,false,false,false,null,false,false,false,false,false,false,null,{"$f":"IFERROR(INDEX(BI6:BN6,MATCH(TRUE,TRANSPOSE(BB6:BG6),0)),\"\")","v":""}]
["cskType",0,"0 = N/A, 1 = NO CSK, 2 = 100 DEG, 3 = 120 DEG",null,"cskDiaMax",{"$f":"CONCATENATE(BP10,BP17,BP24,BP31,BP38,BP45,BP52,AB56,AB57,AB58,AB59,AB60,AC56,AC57,AC58,AC59,AC60,AE64,AE65,AE66,AE67,AE68)","v":""},"only for solid rivet holes",{"$nulls":3},"POS TOL FLOATING",0.019,0.063,0.095,0.09,0.115,0.008,null,{"$f":"AND(B2=1,B4=1)","v":false},{"$f":"AND(B2=1,B4=1)","v":false},{"$f":"AND(B2=1,B4=1)","v":false},{"$f":"AND(B2=1,B4=1)","v":false},{"$f":"AND(B2=1,B4=1)","v":false},{"$f":"AND(B2=1,B4=1)","v":false},null,{"$f":"IF(B3=1,TRUE,FALSE)","v":false},{"$f":"IF(B3=2,TRUE,FALSE)","v":false},{"$f":"IF(B3=1,TRUE,FALSE)","v":false},{"$f":"IF(B3=2,TRUE,FALSE)","v":false},{"$f":"IF(B3=1,TRUE,FALSE)","v":false},{"$f":"IF(B3=2,TRUE,FALSE)","v":false},null,{"$f":"IF(B5=1,TRUE,FALSE)","v":false},{"$f":"IF(B5=1,TRUE,FALSE)","v":false},{"$f":"IF(B5=2,TRUE,FALSE)","v":false},{"$f":"IF(B5=2,TRUE,FALSE)","v":false},{"$f":"IF(B5=3,TRUE,FALSE)","v":false},{"$f":"IF(B5=3,TRUE,FALSE)","v":false},null,{"$f":"IF(B6=1,TRUE,FALSE)","v":false},{"$f":"IF(B6=1,TRUE,FALSE)","v":false},{"$f":"IF(B6=1,TRUE,FALSE)","v":false},{"$f":"IF(B6=1,TRUE,FALSE)","v":false},{"$f":"IF(B6=1,TRUE,FALSE)","v":false},{"$f":"IF(B6=1,TRUE,FALSE)","v":false},{"$nulls":8},{"$f":"AND(S7=TRUE,Z7=TRUE,AG7=TRUE,AN7=TRUE)","v":false},{"$f":"AND(T7=TRUE,AA7=TRUE,AH7=TRUE,AO7=TRUE)","v":false},false,false,false,false,null,false,false,false,false,false,false,null,{"$f":"IFERROR(INDEX(BI7:BN7,MATCH(TRUE,TRANSPOSE(BB7:BG7),0)),\"\")","v":""}]
["rivetSize",0,"0 = N/A, 1  thru 5",null,"cskAng",{"$f":"_xlfn.IFS(B7=1,\"N/A\",B7=2,\"100\",B7=3,\"120\",B7=0,\"\")","v":""},{"$nulls":4},"POS TOL FIXED THD","N/A","N/A",0.071,0.048,0.055,0.103,null,{"$f":"AND(B2=1,B4=1)","v":false},{"$f":"AND(B2=1,B4=1)","v":false},{"$f":"AND(B2=1,B4=1)","v":false},{"$f":"AND(B2=1,B4=1)","v":false},{"$f":"AND(B2=1,B4=1)","v":false},{"$f":"AND(B2=1,B4=1)","v":false},null,{"$f":"IF(B3=1,TRUE,FALSE)","v":false},{"$f":"IF(B3=2,TRUE,FALSE)","v":false},{"$f":"IF(B3=1,TRUE,FALSE)","v":false},{"$f":"IF(B3=2,TRUE,FALSE)","v":false},{"$f":"IF(B3=1,TRUE,FALSE)","v":false},{"$f":"IF(B3=2,TRUE,FALSE)","v":false},null,{"$f":"IF(B5=1,TRUE,FALSE)","v":false},{"$f":"IF(B5=1,TRUE,FALSE)","v":false},{"$f":"IF(B5=2,TRUE,FALSE)","v":false},{"$f":"IF(B5=2,TRUE,FALSE)","v":false},{"$f":"IF(B5=3,TRUE,FALSE)","v":false},{"$f":"IF(B5=3,TRUE,FALSE)","v":false},null,{"$f":"IF(B6=2,TRUE,FALSE)","v":false},{"$f":"IF(B6=2,TRUE,FALSE)","v":false},{"$f":"IF(B6=2,TRUE,FALSE)","v":false},{"$f":"IF(B6=2,TRUE,FALSE)","v":false},{"$f":"IF(B6=2,TRUE,FALSE)","v":false},{"$f":"IF(B6=2,TRUE,FALSE)","v":false},{"$nulls":8},{"$f":"AND(S8=TRUE,Z8=TRUE,AG8=TRUE,AN8=TRUE)","v":false},{"$f":"AND(T8=TRUE,AA8=TRUE,AH8=TRUE,AO8=TRUE)","v":false},{"$f":"AND(U8=TRUE,AB8=TRUE,AI8=TRUE,AP8=TRUE)","v":false},{"$f":"AND(V8=TRUE,AC8=TRUE,AJ8=TRUE,AQ8=TRUE)","v":false},{"$f":"AND(W8=TRUE,AD8=TRUE,AK8=TRUE,AR8=TRUE)","v":false},{"$f":"AND(X8=TRUE,AE8=TRUE,AL8=TRUE,AS8=TRUE)","v":false},null,false,false,false,false,false,false,null,{"$f":"IFERROR(INDEX(BI8:BN8,MATCH(TRUE,TRANSPOSE(BB8:BG8),0)),\"\")","v":""}]
["rivType",0,"0 = N/A, 1 = BLD, 2 = SOLID, purely to track state of the buttons",null,"cskModelToDia",{"$f":"CONCATENATE(AG64,AG65,AG66,AG67,AG68)","v":""},{"$nulls":4},"POS TOL FIXED CLR",0.052,0.01,0.014,0.037,0.081,0.003,null,{"$f":"AND(B2=1,B4=1)","v":false},{"$f":"AND(B2=1,B4=1)","v":false},{"$f":"AND(B2=1,B4=1)","v":false},{"$f":"AND(B2=1,B4=1)","v":false},{"$f":"AND(B2=1,B4=1)","v":false},{"$f":"AND(B2=1,B4=1)","v":false},null,{"$f":"IF(B3=1,TRUE,FALSE)","v":false},{"$f":"IF(B3=2,TRUE,FALSE)","v":false},{"$f":"IF(B3=1,TRUE,FALSE)","v":false},{"$f":"IF(B3=2,TRUE,FALSE)","v":false},{"$f":"IF(B3=1,TRUE,FALSE)","v":false},{"$f":"IF(B3=2,TRUE,FALSE)","v":false},null,{"$f":"IF(B5=1,TRUE,FALSE)","v":false},{"$f":"IF(B5=1,TRUE,FALSE)","v":false},{"$f":"IF(B5=2,TRUE,FALSE)","v":false},{"$f":"IF(B5=2,TRUE,FALSE)","v":false},{"$f":"IF(B5=3,TRUE,FALSE)","v":false},{"$f":"IF(B5=3,TRUE,FALSE)","v":false},null,{"$f":"IF(B6=3,TRUE,FALSE)","v":false},{"$f":"IF(B6=3,TRUE,FALSE)","v":false},{"$f":"IF(B6=3,TRUE,FALSE)","v":false},{"$f":"IF(B6=3,TRUE,FALSE)","v":false},{"$f":"IF(B6=3,TRUE,FALSE)","v":false},{"$f":"IF(B6=3,TRUE,FALSE)","v":false},{"$nulls":8},false,false,false,false,false,false,null,false,false,false,false,false,false,null,{"$f":"IFERROR(INDEX(BI9:BN9,MATCH(TRUE,TRANSPOSE(BB9:BG9),0)),\"\")","v":""}]
[{"$nulls":10},"C-SINK DIA @ 100 DEG",0.109,0.069,0.061,0.107,0.116,0.104,null,{"$f":"AND(B2=1,B4=1)","v":false},{"$f":"AND(B2=1,B4=1)","v":false},{"$f":"AND(B2=1,B4=1)","v":false},{"$f":"AND(B2=1,B4=1)","v":false},{"$f":"AND(B2=1,B4=1)","v":false},{"$f":"AND(B2=1,B4=1)","v":false},null,{"$f":"IF(B3=1,TRUE,FALSE)","v":false},{"$f":"IF(B3=2,TRUE,FALSE)","v":false},{"$f":"IF(B3=1,TRUE,FALSE)","v":false},{"$f":"IF(B3=2,TRUE,FALSE)","v":false},{"$f":"IF(B3=1,TRUE,FALSE)","v":false},{"$f":"IF(B3=2,TRUE,FALSE)","v":false},null,{"$f":"IF(B5=1,TRUE,FALSE)","v":false},{"$f":"IF(B5=1,TRUE,FALSE)","v":false},{"$f":"IF(B5=2,TRUE,FALSE)","v":false},{"$f":"IF(B5=2,TRUE,FALSE)","v":false},{"$f":"IF(B5=3,TRUE,FALSE)","v":false},{"$f":"IF(B5=3,TRUE,FALSE)","v":false},{"$nulls":8},{"$f":"IF(B7=2,TRUE,FALSE)","v":false},{"$f":"IF(B7=2,TRUE,FALSE)","v":false},{"$f":"IF(B7=2,TRUE,FALSE)","v":false},{"$f":"IF(B7=2,TRUE,FALSE)","v":false},{"$f":"IF(B7=2,TRUE,FALSE)","v":false},{"$f":"IF(B7=2,TRUE,FALSE)","v":false},null,{"$f":"AND(S10=TRUE,Z10=TRUE,AG10=TRUE,AU10=TRUE)","v":false},{"$f":"AND(T10=TRUE,AA10=TRUE,AH10=TRUE,AV10=TRUE)","v":false},false,false,false,false,null,false,false,false,false,false,false,null,{"$f":"IFERROR(INDEX(BI10:BN10,MATCH(TRUE,TRANSPOSE(BB10:BG10),0)),\"\")","v":""}]
[{"$nulls":8},2,".138(#6)","HOLE LIMIT MAX",0.04,0.005,0.006,0.085,0.122,0.085,null,{"$f":"AND(B2=1,B4=2)","v":false},{"$f":"AND(B2=1,B4=2)","v":false},{"$f":"AND(B2=1,B4=2)","v":false},{"$f":"AND(B2=1,B4=2)","v":false},{"$f":"AND(B2=1,B4=2)","v":false},{"$f":"AND(B2=1,B4=2)","v":false},null,{"$f":"IF(B3=1,TRUE,FALSE)","v":false},{"$f":"IF(B3=2,TRUE,FALSE)","v":false},{"$f":"IF(B3=1,TRUE,FALSE)","v":false},{"$f":"IF(B3=2,TRUE,FALSE)","v":false},{"$f":"IF(B3=1,TRUE,FALSE)","v":false},{"$f":"IF(B3=2,TRUE,FALSE)","v":false},null,{"$f":"IF(B5=1,TRUE,FALSE)","v":false},{"$f":"IF(B5=1,TRUE,FALSE)","v":false},{"$f":"IF(B5=2,TRUE,FALSE)","v":false},{"$f":"IF(B5=2,TRUE,FALSE)","v":false},{"$f":"IF(B5=3,TRUE,FALSE)","v":false},{"$f":"IF(B5=3,TRUE,FALSE)","v":false},{"$nulls":15},{"$f":"AND(S11=TRUE,Z11=TRUE,AG11=TRUE)","v":false},{"$f":"AND(T11=TRUE,AA11=TRUE,AH11=TRUE)","v":false},{"$f":"AND(U11=TRUE,AB11=TRUE,AI11=TRUE)","v":false},{"$f":"AND(V11=TRUE,AC11=TRUE,AJ11=TRUE)","v":false},{"$f":"AND(W11=TRUE,AD11=TRUE,AK11=TRUE)","v":false},{"$f":"AND(X11=TRUE,AE11=TRUE,AL11=TRUE)","v":false},null,false,false,false,false,false,false,null,{"$f":"IFERROR(INDEX(BI11:BN11,MATCH(TRUE,TRANSPOSE(BB11:BG11),0)),\"\")","v":""}]
[{"$nulls":10},"HOLE LIMIT MIN",0.057,1E-3,0.114,0.042,0.012,0.115,null,{"$f":"AND(B2=1,B4=2)","v":false},{"$f":"AND(B2=1,B4=2)","v":false},{"$f":"AND(B2=1,B4=2)","v":false},{"$f":"AND(B2=1,B4=2)","v":false},{"$f":"AND(B2=1,B4=2)","v":false},{"$f":"AND(B2=1,B4=2)","v":false},null,{"$f":"IF(B3=1,TRUE,FALSE)","v":false},{"$f":"IF(B3=2,TRUE,FALSE)","v":false},{"$f":"IF(B3=1,TRUE,FALSE)","v":false},{"$f":"IF(B3=2,TRUE,FALSE)","v":false},{"$f":"IF(B3=1,TRUE,FALSE)","v":false},{"$f":"IF(B3=2,TRUE,FALSE)","v":false},null,{"$f":"IF(B5=1,TRUE,FALSE)","v":false},{"$f":"IF(B5=1,TRUE,FALSE)","v":false},{"$f":"IF(B5=2,TRUE,FALSE)","v":false},{"$f":"IF(B5=2,TRUE,FALSE)","v":false},{"$f":"IF(B5=3,TRUE,FALSE)","v":false},{"$f":"IF(B5=3,TRUE,FALSE)","v":false},{"$nulls":15},{"$f":"AND(S12=TRUE,Z12=TRUE,AG12=TRUE)","v":false},false,false,false,false,false,null,false,false,false,false,false,false,null,{"$f":"IFERROR(INDEX(BI12:BN12,MATCH(TRUE,TRANSPOSE(BB12:BG12),0)),\"\")","v":""}]
[{"$nulls":10},"MODEL TO DIAMETER",0.113,0.09,0.031,0.05,0.104,0.06,null,{"$f":"AND(B2=1,B4=2)","v":false},{"$f":"AND(B2=1,B4=2)","v":false},{"$f":"AND(B2=1,B4=2)","v":false},{"$f":"AND(B2=1,B4=2)","v":false},{"$f":"AND(B2=1,B4=2)","v":false},{"$f":"AND(B2=1,B4=2)","v":false},null,{"$f":"IF(B3=1,TRUE,FALSE)","v":false},{"$f":"IF(B3=2,TRUE,FALSE)","v":false},{"$f":"IF(B3=1,TRUE,FALSE)","v":false},{"$f":"IF(B3=2,TRUE,FALSE)","v":false},{"$f":"IF(B3=1,TRUE,FALSE)","v":false},{"$f":"IF(B3=2,TRUE,FALSE)","v":false},null,{"$f":"IF(B5=1,TRUE,FALSE)","v":false},{"$f":"IF(B5=1,TRUE,FALSE)","v":false},{"$f":"IF(B5=2,TRUE,FALSE)","v":false},{"$f":"IF(B5=2,TRUE,FALSE)","v":false},{"$f":"IF(B5=3,TRUE,FALSE)","v":false},{"$f":"IF(B5=3,TRUE,FALSE)","v":false},{"$nulls":15},{"$f":"AND(S13=TRUE,Z13=TRUE,AG13=TRUE)","v":false},false,false,false,false,false,null,false,false,false,false,false,false,null,{"$f":"IFERROR(INDEX(BI13:BN13,MATCH(TRUE,TRANSPOSE(BB13:BG13),0)),\"\")","v":""}]
[{"$nulls":10},"POS TOL FLOATING",0.111,0.004,0.1,0.016,0.058,0.027,null,{"$f":"AND(B2=1,B4=2)","v":false},{"$f":"AND(B2=1,B4=2)","v":false},{"$f":"AND(B2=1,B4=2)","v":false},{"$f":"AND(B2=1,B4=2)","v":false},{"$f":"AND(B2=1,B4=2)","v":false},{"$f":"AND(B2=1,B4=2)","v":false},null,{"$f":"IF(B3=1,TRUE,FALSE)","v":false},{"$f":"IF(B3=2,TRUE,FALSE)","v":false},{"$f":"IF(B3=1,TRUE,FALSE)","v":false},{"$f":"IF(B3=2,TRUE,FALSE)","v":false},{"$f":"IF(B3=1,TRUE,FALSE)","v":false},{"$f":"IF(B3=2,TRUE,FALSE)","v":false},null,{"$f":"IF(B5=1,TRUE,FALSE)","v":false},{"$f":"IF(B5=1,TRUE,FALSE)","v":false},{"$f":"IF(B5=2,TRUE,FALSE)","v":false},{"$f":"IF(B5=2,TRUE,FALSE)","v":false},{"$f":"IF(B5=3,TRUE,FALSE)","v":false},{"$f":"IF(B5=3,TRUE,FALSE)","v":false},null,{"$f":"IF(B6=1,TRUE,FALSE)","v":false},{"$f":"IF(B6=1,TRUE,FALSE)","v":false},{"$f":"IF(B6=1,TRUE,FALSE)","v":false},{"$f":"IF(B6=1,TRUE,FALSE)","v":false},{"$f":"IF(B6=1,TRUE,FALSE)","v":false},{"$f":"IF(B6=1,TRUE,FALSE)","v":false},{"$nulls":8},{"$f":"AND(S14=TRUE,Z14=TRUE,AG14=TRUE,AN14=TRUE)","v":false},{"$f":"AND(T14=TRUE,AA14=TRUE,AH14=TRUE,AO14=TRUE)","v":false},{"$f":"AND(U14=TRUE,AB14=TRUE,AI14=TRUE,AP14=TRUE)","v":false},{"$f":"AND(V14=TRUE,AC14=TRUE,AJ14=TRUE,AQ14=TRUE)","v":false},{"$f":"AND(W14=TRUE,AD14=TRUE,AK14=TRUE,AR14=TRUE)","v":false},{"$f":"AND(X14=TRUE,AE14=TRUE,AL14=TRUE,AS14=TRUE)","v":false},null,false,false,false,false,false,false,null,{"$f":"IFERROR(INDEX(BI14:BN14,MATCH(TRUE,TRANSPOSE(BB14:BG14),0)),\"\")","v":""}]
[{"$nulls":10},"POS TOL FIXED THD","N/A","N/A",0.121,0.101,0.094,0.102,null,{"$f":"AND(B2=1,B4=2)","v":false},{"$f":"AND(B2=1,B4=2)","v":false},{"$f":"AND(B2=1,B4=2)","v":false},{"$f":"AND(B2=1,B4=2)","v":false},{"$f":"AND(B2=1,B4=2)","v":false},{"$f":"AND(B2=1,B4=2)","v":false},null,{"$f":"IF(B3=1,TRUE,FALSE)","v":false},{"$f":"IF(B3=2,TRUE,FALSE)","v":false},{"$f":"IF(B3=1,TRUE,FALSE)","v":false},{"$f":"IF(B3=2,TRUE,FALSE)","v":false},{"$f":"IF(B3=1,TRUE,FALSE)","v":false},{"$f":"IF(B3=2,TRUE,FALSE)","v":false},null,{"$f":"IF(B5=1,TRUE,FALSE)","v":false},{"$f":"IF(B5=1,TRUE,FALSE)","v":false},{"$f":"IF(B5=2,TRUE,FALSE)","v":false},{"$f":"IF(B5=2,TRUE,FALSE)","v":false},{"$f":"IF(B5=3,TRUE,FALSE)","v":false},{"$f":"IF(B5=3,TRUE,FALSE)","v":false},null,{"$f":"IF(B6=2,TRUE,FALSE)","v":false},{"$f":"IF(B6=2,TRUE,FALSE)","v":false},{"$f":"IF(B6=2,TRUE,FALSE)","v":false},{"$f":"IF(B6=2,TRUE,FALSE)","v":false},{"$f":"IF(B6=2,TRUE,FALSE)","v":false},{"$f":"IF(B6=2,TRUE,FALSE)","v":false},{"$nulls":8},{"$f":"AND(S15=TRUE,Z15=TRUE,AG15=TRUE,AN15=TRUE)","v":false},false,false,false,false,false,null,false,false,false,false,false,false,null,{"$f":"IFERROR(INDEX(BI15:BN15,MATCH(TRUE,TRANSPOSE(BB15:BG15),0)),\"\")","v":""}]
[{"$nulls":10},"POS TOL FIXED CLR",0.071,0.118,0.064,0.047,0.019,0.061,null,{"$f":"AND(B2=1,B4=2)","v":false},{"$f":"AND(B2=1,B4=2)","v":false},{"$f":"AND(B2=1,B4=2)","v":false},{"$f":"AND(B2=1,B4=2)","v":false},{"$f":"AND(B2=1,B4=2)","v":false},{"$f":"AND(B2=1,B4=2)","v":false},null,{"$f":"IF(B3=1,TRUE,FALSE)","v":false},{"$f":"IF(B3=2,TRUE,FALSE)","v":false},{"$f":"IF(B3=1,TRUE,FALSE)","v":false},{"$f":"IF(B3=2,TRUE,FALSE)","v":false},{"$f":"IF(B3=1,TRUE,FALSE)","v":false},{"$f":"IF(B3=2,TRUE,FALSE)","v":false},null,{"$f":"IF(B5=1,TRUE,FALSE)","v":false},{"$f":"IF(B5=1,TRUE,FALSE)","v":false},{"$f":"IF(B5=2,TRUE,FALSE)","v":false},{"$f":"IF(B5=2,TRUE,FALSE)","v":false},{"$f":"IF(B5=3,TRUE,FALSE)","v":false},{"$f":"IF(B5=3,TRUE,FALSE)","v":false},null,{"$f":"IF(B6=3,TRUE,FALSE)","v":false},{"$f":"IF(B6=3,TRUE,FALSE)","v":false},{"$f":"IF(B6=3,TRUE,FALSE)","v":false},{"$f":"IF(B6=3,TRUE,FALSE)","v":false},{"$f":"IF(B6=3,TRUE,FALSE)","v":false},{"$f":"IF(B6=3,TRUE,FALSE)","v":false},{"$nulls":8},false,false,false,false,false,false,null,false,false,false,false,false,false,null,{"$f":"IFERROR(INDEX(BI16:BN16,MATCH(TRUE,TRANSPOSE(BB16:BG16),0)),\"\")","v":""}]
[{"$nulls":10},"C-SINK DIA @ 100 DEG",0.078,0.029,0.114,0.033,0.122,0.018,null,{"$f":"AND(B2=1,B4=2)","v":false},{"$f":"AND(B2=1,B4=2)","v":false},{"$f":"AND(B2=1,B4=2)","v":false},{"$f":"AND(B2=1,B4=2)","v":false},{"$f":"AND(B2=1,B4=2)","v":false},{"$f":"AND(B2=1,B4=2)","v":false},null,{"$f":"IF(B3=1,TRUE,FALSE)","v":false},{"$f":"IF(B3=2,TRUE,FALSE)","v":false},{"$f":"IF(B3=1,TRUE,FALSE)","v":false},{"$f":"IF(B3=2,TRUE,FALSE)","v":false},{"$f":"IF(B3=1,TRUE,FALSE)","v":false},{"$f":"IF(B3=2,TRUE,FALSE)","v":false},null,{"$f":"IF(B5=1,TRUE,FALSE)","v":false},{"$f":"IF(B5=1,TRUE,FALSE)","v":false},{"$f":"IF(B5=2,TRUE,FALSE)","v":false},{"$f":"IF(B5=2,TRUE,FALSE)","v":false},{"$f":"IF(B5=3,TRUE,FALSE)","v":false},{"$f":"IF(B5=3,TRUE,FALSE)","v":false},{"$nulls":8},{"$f":"IF(B7=2,TRUE,FALSE)","v":false},{"$f":"IF(B7=2,TRUE,FALSE)","v":false},{"$f":"IF(B7=2,TRUE,FALSE)","v":false},{"$f":"IF(B7=2,TRUE,FALSE)","v":false},{"$f":"IF(B7=2,TRUE,FALSE)","v":false},{"$f":"IF(B7=2,TRUE,FALSE)","v":false},null,{"$f":"AND(S17=TRUE,Z17=TRUE,AG17=TRUE,AU17=TRUE)","v":false},{"$f":"AND(T17=TRUE,AA17=TRUE,AH17=TRUE,AV17=TRUE)","v":false},{"$f":"AND(U17=TRUE,AB17=TRUE,AI17=TRUE,AW17=TRUE)","v":false},{"$f":"AND(V17=TRUE,AC17=TRUE,AJ17=TRUE,AX17=TRUE)","v":false},{"$f":"AND(W17=TRUE,AD17=TRUE,AK17=TRUE,AY17=TRUE)","v":false},{"$f":"AND(X17=TRUE,AE17=TRUE,AL17=TRUE,AZ17=TRUE)","v":false},null,false,false,false,false,false,false,null,{"$f":"IFERROR(INDEX(BI17:BN17,MATCH(TRUE,TRANSPOSE(BB17:BG17),0)),\"\")","v":""}]
[{"$nulls":8},3,".164(#8)","HOLE LIMIT MAX",0.023,0.029,0.099,0.07,0.066,0.05,null,{"$f":"AND(B2=1,B4=3)","v":false},{"$f":"AND(B2=1,B4=3)","v":false},{"$f":"AND(B2=1,B4=3)","v":false},{"$f":"AND(B2=1,B4=3)","v":false},{"$f":"AND(B2=1,B4=3)","v":false},{"$f":"AND(B2=1,B4=3)","v":false},null,{"$f":"IF(B3=1,TRUE,FALSE)","v":false},{"$f":"IF(B3=2,TRUE,FALSE)","v":false},{"$f":"IF(B3=1,TRUE,FALSE)","v":false},{"$f":"IF(B3=2,TRUE,FALSE)","v":false},{"$f":"IF(B3=1,TRUE,FALSE)","v":false},{"$f":"IF(B3=2,TRUE,FALSE)","v":false},null,{"$f":"IF(B5=1,TRUE,FALSE)","v":false},{"$f":"IF(B5=1,TRUE,FALSE)","v":false},{"$f":"IF(B5=2,TRUE,FALSE)","v":false},{"$f":"IF(B5=2,TRUE,FALSE)","v":false},{"$f":"IF(B5=3,TRUE,FALSE)","v":false},{"$f":"IF(B5=3,TRUE,FALSE)","v":false},{"$nulls":15},{"$f":"AND(S18=TRUE,Z18=TRUE,AG18=TRUE)","v":false},{"$f":"AND(T18=TRUE,AA18=TRUE,AH18=TRUE)","v":false},{"$f":"AND(U18=TRUE,AB18=TRUE,AI18=TRUE)","v":false},{"$f":"AND(V18=TRUE,AC18=TRUE,AJ18=TRUE)","v":false},{"$f":"AND(W18=TRUE,AD18=TRUE,AK18=TRUE)","v":false},{"$f":"AND(X18=TRUE,AE18=TRUE,AL18=TRUE)","v":false},null,false,false,false,false,false,false,null,{"$f":"IFERROR(INDEX(BI18:BN18,MATCH(TRUE,TRANSPOSE(BB18:BG18),0)),\"\")","v":""}]
[{"$nulls":10},"HOLE LIMIT MIN",0.116,0.009,0.057,0.073,0.006,0.044,null,{"$f":"AND(B2=1,B4=3)","v":false},{"$f":"AND(B2=1,B4=3)","v":false},{"$f":"AND(B2=1,B4=3)","v":false},{"$f":"AND(B2=1,B4=3)","v":false},{"$f":"AND(B2=1,B4=3)","v":false},{"$f":"AND(B2=1,B4=3)","v":false},null,{"$f":"IF(B3=1,TRUE,FALSE)","v":false},{"$f":"IF(B3=2,TRUE,FALSE)","v":false},{"$f":"IF(B3=1,TRUE,FALSE)","v":false},{"$f":"IF(B3=2,TRUE,FALSE)","v":false},{"$f":"IF(B3=1,TRUE,FALSE)","v":false},{"$f":"IF(B3=2,TRUE,FALSE)","v":false},null,{"$f":"IF(B5=1,TRUE,FALSE)","v":false},{"$f":"IF(B5=1,TRUE,FALSE)","v":false},{"$f":"IF(B5=2,TRUE,FALSE)","v":false},{"$f":"IF(B5=2,TRUE,FALSE)","v":false},{"$f":"IF(B5=3,TRUE,FALSE)","v":false},{"$f":"IF(B5=3,TRUE,FALSE)","v":false},{"$nulls":15},{"$f":"AND(S19=TRUE,Z19=TRUE,AG19=TRUE)","v":false},false,false,false,false,false,null,false,false,false,false,false,false,null,{"$f":"IFERROR(INDEX(BI19:BN19,MATCH(TRUE,TRANSPOSE(BB19:BG19),0)),\"\")","v":""}]
[{"$nulls":10},"MODEL TO DIAMETER",0.09,0.106,0.036,0.026,0.089,0.005,null,{"$f":"AND(B2=1,B4=3)","v":false},{"$f":"AND(B2=1,B4=3)","v":false},{"$f":"AND(B2=1,B4=3)","v":false},{"$f":"AND(B2=1,B4=3)","v":false},{"$f":"AND(B2=1,B4=3)","v":false},{"$f":"AND(B2=1,B4=3)","v":false},null,{"$f":"IF(B3=1,TRUE,FALSE)","v":false},{"$f":"IF(B3=2,TRUE,FALSE)","v":false},{"$f":"IF(B3=1,TRUE,FALSE)","v":false},{"$f":"IF(B3=2,TRUE,FALSE)","v":false},{"$f":"IF(B3=1,TRUE,FALSE)","v":false},{"$f":"IF(B3=2,TRUE,FALSE)","v":false},null,{"$f":"IF(B5=1,TRUE,FALSE)","v":false},{"$f":"IF(B5=1,TRUE,FALSE)","v":false},{"$f":"IF(B5=2,TRUE,FALSE)","v":false},{"$f":"IF(B5=2,TRUE,FALSE)","v":false},{"$f":"IF(B5=3,TRUE,FALSE)","v":false},{"$f":"IF(B5=3,TRUE,FALSE)","v":false},{"$nulls":15},{"$f":"AND(S20=TRUE,Z20=TRUE,AG20=TRUE)","v":false},false,false,false,false,false,null,false,{"$f":"IF(BC20=TRUE,M20)","v":false},{"$f":"IF(BD20=TRUE,N20)","v":false},{"$f":"IF(BE20=TRUE,O20)","v":false},{"$f":"IF(BF20=TRUE,P20)","v":false},{"$f":"IF(BG20=TRUE,Q20)","v":false},null,{"$f":"IFERROR(INDEX(BI20:BN20,MATCH(TRUE,TRANSPOSE(BB20:BG20),0)),\"\")","v":""}]
{"$rows_left_out":49}
{"sheet":"about","index":2,"n_rows":14,"n_cols":3,"rows_kept":14}
["Hole Sizing Guide Demo Version"]
["Created by George Austria"]
[]
["Version History",null,"Known Issues / Planned Improvements"]
["v1-1, 11-29-2023",null,"Odd behavior in conditional formatting for pink cells, often requires extra click somewhere for conditional formatting to update fully."]
["Error corrected, 5/16 screw Sheet metal Tight Fit Floating .016 -> .014",null,"Buttons may not work on certain monitors when using multiple monitors (this seems to be a known issue with ActiveX buttons not working on different resolution screens)"]
["Changed Sheet1 G6 Text Control to \"Srink to Fit\", as 0.022+.01 was not displaying legibly",null,"Dark Mode"]
[null,null,"Accessibility Improvements (higher contrast theme, alt text on buttons)"]
["v1-0, 11-27-2023",null,"Issue with some users with buttons appearing glitch out when interacted with."]
[null,null,"Add counterbore support"]
["v0-5, 11-22-2023",null,"Add \"Model to diameter\" output, with options to see results according to the standard and according to NX hole command presets."]
["Added information message for sheet metal + threaded hole scenario",null,"Add hole depth support"]
[null,null,"More descriptive information messages when countersink data is unavailable"]
[null,null,"Add \"table view\" feature, where the outputs are displayed by highlighting the results on a table. "]